Benzeneethanol, α-propyl-

Normal alkane RI, polar column, temperature ramp

Data compiled by: NIST Mass Spectrometry Data Center, William E. Wallace, director

Column type Capillary
Active phase HP-Innowax
Column length (m) 50.
Carrier gas Helium
Substrate
Column diameter (mm) 0.20
Phase thickness (μm) 0.20
Tstart (C) 45.
Tend (C) 190.
Heat rate (K/min) 4.
Initial hold (min) 2.
Final hold (min) 50.
I 2256.
ReferenceSoria, Sanz, et al., 2008
Comment MSDC-RI

References

Soria, Sanz, et al., 2008
Soria, A.C.; Sanz, J.; Martinez-Castro, I., SPME followed by GC-MS: a powerful technique for qualitative analysis of honey volatiles, Eur. Food Res. Technol., 2008, 1-12. [all data]