cis-4,10-epoxy-Amorphane

Van Den Dool and Kratz RI, non-polar column, temperature ramp

Data compiled by: NIST Mass Spectrometry Data Center, William E. Wallace, director

Column type Capillary
Active phase DB-5
Column length (m) 30.
Carrier gas He
Substrate
Column diameter (mm) 0.25
Phase thickness (μm) 0.25
Tstart (C) 50.
Tend (C) 250.
Heat rate (K/min) 3.
Initial hold (min)
Final hold (min) 10.
I 1482.
ReferenceYu, Liao, et al., 2007
Comment MSDC-RI

References

Yu, Liao, et al., 2007
Yu, J.Q.; Liao, Z.X.; Cai, X.Q.; Lei, J.C.; Zou, G.L., Composition, antimicrobial activity and cytotoxicity of essential oils from Aristolochia mollissima, Environmental Toxicology and Pharmacology, 2007, 23, 2, 162-167, https://doi.org/10.1016/j.etap.2006.08.004 . [all data]