Cyclobutane, 1,3-bis[2-(2-isopropyl-3,3-dimethyloxiran-2-yl)ethenyl]-2,4-diacetyl-

Normal alkane RI, non-polar column, temperature ramp

Data compiled by: NIST Mass Spectrometry Data Center, William E. Wallace, director

Column type CapillaryCapillary
Active phase HP-5 MSHP-5 MS
Column length (m) 30.30.
Carrier gas  Helium
Substrate
Column diameter (mm) 0.250.25
Phase thickness (μm) 0.250.25
Tstart (C) 60.60.
Tend (C) 300.300.
Heat rate (K/min) 15.15.
Initial hold (min) 2.2.
Final hold (min) 10.10.
I 2674.2674.
ReferenceXu, Han, et al., 2012Xu, Han, et al., 2009
Comment MSDC-RI MSDC-RI

References

Xu, Han, et al., 2012
Xu, L.-L.; Han, T.; Wu, J.-Z.; Zhang, Q.-Y.; Zhang, H.; Huang, B.-K.; Rahman, K., Comparative research of chemical constituents, antifungal and antitumor properties of ether extracts of Panax ginseng and its endophytic fungus, 2012, retrieved from http://www.thefreelibrary.com/Comparative .... [all data]

Xu, Han, et al., 2009
Xu, L.-L.; Han, T.; Wu, J.-Z.; Zhang, Q.-Y.; Zhang, H.; Huang, B.-K.; Rahman, K., Comparative research of chemical constituents, antifungal and antitumor properties of ether extracts of Panax ginseng and its endophytic fungus, Phytomedicine: Int. J. Phytotherapy Phytopharmacology, 2009, 16, 6-7, 609-616, https://doi.org/10.1016/j.phymed.2009.03.014 . [all data]