endo-5,6-Bis(hydroxymethyl)bicyclo[2.2.1]hept-2-ene

Phase change data

Data compiled by: Thermodynamics Research Center, NIST Boulder Laboratories, Chris Muzny director

Quantity Value Units Method Reference Comment
Ttriple353.KN/AWeinstein, Leffler, et al., 1984Crystal phase 1 phase; Uncertainty assigned by TRC = 1.5 K

In addition to the Thermodynamics Research Center (TRC) data available from this site, much more physical and chemical property data is available from the following TRC products:

References

Weinstein, Leffler, et al., 1984
Weinstein, D.I.; Leffler, A.J.; Currie, J.A., Phase Transitions in Bicyclic Compounds, Mol. Cryst. Liq. Cryst., 1984, 104, 95. [all data]