Androst-5-en-17-one, 3,16-bis[(trimethylsilyl)oxy]-, O-(trimethylsilyl)oxime, (3β,16β)-

Van Den Dool and Kratz RI, non-polar column, temperature ramp

Data compiled by: NIST Mass Spectrometry Data Center, William E. Wallace, director

Column type CapillaryCapillaryCapillaryCapillary
Active phase OV-1SE-30OV-1SE-30
Column length (m)  25. 25.
Carrier gas HeN2HeN2
Substrate
Column diameter (mm)  0.5 0.5
Phase thickness (μm)
Tstart (C) 180.210.180.210.
Tend (C) 250.260.250.260.
Heat rate (K/min) 1.1.1.1.
Initial hold (min)
Final hold (min)
I 2800.2763.2773.2762.
ReferenceBègue, Dumas, et al., 1979Bègue, Dumas, et al., 1979Bègue, Dumas, et al., 1979Bègue, Dumas, et al., 1979
Comment MSDC-RI MSDC-RI MSDC-RI MSDC-RI

References

Bègue, Dumas, et al., 1979
Bègue, R.-J.; Dumas, M.; Morinière, M.; Nivois, C.; Padieu, P., Steroids and hypertension. 1-Gas-liquid chromatography and gas chromatography mass spectrometry of 3,15- and 3,16-dihydroxy-17-oxosteroids, Biomed. Mass Spectrom., 1979, 6, 11, 476-481, https://doi.org/10.1002/bms.1200061104 . [all data]