Acetamide, 2-chloro-N-(2,6-diethylphenyl)-

Normal alkane RI, non-polar column, temperature ramp

View large format table.

Column type Active phase I Reference Comment
CapillaryDB-51716.Sette, da Costa, et al., 200430. m/0.25 mm/0.25 μm, He, 15. K/min; Tstart: 80. C; Tend: 290. C
CapillaryDurabond-51721.Pereira, Rostad, et al., 199030. m/0.25 mm/0.25 μm, Helium, 50. C @ 4. min, 6. K/min; Tend: 300. C

Lee's RI, non-polar column, temperature ramp

View large format table.

Column type Active phase I Reference Comment
CapillaryDurabond-5289.93Pereira, Rostad, et al., 199030. m/0.25 mm/0.25 μm, Helium, 50. C @ 4. min, 6. K/min; Tend: 300. C

References

Sette, da Costa, et al., 2004
Sette, L.D.; da Costa, L.A.M.A.; Marsaioli, A.J.; Manfio, G.P., Biodegradation of alachlor by soil streptomycetes, Appl. Microbiol. Biotechnol., 2004, 64, 5, 712-717, https://doi.org/10.1007/s00253-003-1494-1 . [all data]

Pereira, Rostad, et al., 1990
Pereira, W.E.; Rostad, C.E.; Leiker, T.J., Determination of trace levels of herbicides and their degradation products in surface and ground waters by gas chromatography/ion trap mass spectrometry, Anal. Chim. Acta, 1990, 228, 69-75, https://doi.org/10.1016/S0003-2670(00)80480-8 . [all data]