Bicyclo[2.2.1]hept-2-ene, 2-methyl-

Phase change data

Data compiled by: Thermodynamics Research Center, NIST Boulder Laboratories, Chris Muzny director

Quantity Value Units Method Reference Comment
Tboil391.KN/ABrown, Ayyangar, et al., 1964Uncertainty assigned by TRC = 2. K

In addition to the Thermodynamics Research Center (TRC) data available from this site, much more physical and chemical property data is available from the following TRC products:

Condensed phase thermochemistry data

Data compiled by: Hussein Y. Afeefy, Joel F. Liebman, and Stephen E. Stein

Quantity Value Units Method Reference Comment
Δfliquid4.4 ± 1.8kJ/molCcbKozina, Timofeeva, et al., 1971
Quantity Value Units Method Reference Comment
Δcliquid-4867.5 ± 1.7kJ/molCcbKozina, Timofeeva, et al., 1971Corresponding Δfliquid = 4.48 kJ/mol (simple calculation by NIST; no Washburn corrections)

Gas phase ion energetics data

Data evaluated as indicated in comments:
HL - Edward P. Hunter and Sharon G. Lias

Data compiled as indicated in comments:
LL - Sharon G. Lias and Joel F. Liebman

Quantity Value Units Method Reference Comment
Proton affinity (review)202.kcal/molN/AHunter and Lias, 1998HL
Quantity Value Units Method Reference Comment
Gas basicity194.2kcal/molN/AHunter and Lias, 1998HL

Ionization energy determinations

IE (eV) Method Reference Comment
8.1PEWen, Hitchcock, et al., 1990LL
8.5PEWen, Hitchcock, et al., 1990Vertical value; LL

Kovats' RI, non-polar column, custom temperature program

View large format table.

Column type Active phase I Reference Comment
CapillaryDB-5MS1097.Tuberoso, Kowalczyk, et al., 200530. m/0.25 mm/0.25 μm, He; Program: 60C(5min) => 2C/min => 140C= 5C/min => 250C(5min)

References

Brown, Ayyangar, et al., 1964
Brown, H.C.; Ayyangar, N.R.; Zweifel, G., Hydroboration XIX. The Reaction of Diisopinocpmpheylborane with Representative trand and Hindered Olefins. Triisopinocampheldiborane as A Reagent for the Configuraional Assignment of Alcohols and Ole, J. Am. Chem. Soc., 1964, 86, 1071-6. [all data]