2-ethyl-2-methylthiazolidine

Van Den Dool and Kratz RI, polar column, temperature ramp

View large format table.

Column type Active phase I Reference Comment
CapillaryDB-Wax1491.Chung, Eiserich, et al., 1994He, 60. C @ 4. min, 3. K/min, 220. C @ 30. min; Column length: 60. m; Column diameter: 0.25 mm

Normal alkane RI, non-polar column, custom temperature program

View large format table.

Column type Active phase I Reference Comment
CapillaryDB-51058.Didzbalis and Ho, 200160. m/0.25 mm/0.25 μm, Helium; Program: 35 0C (2 min) 30 0C/min -> 60 0C (1 min) 6 0C/min -> 250 0C (10 min)

References

Chung, Eiserich, et al., 1994
Chung, T.Y.; Eiserich, J.P.; Shibamoto, T., Volatile compounds produced from peanut oil heated with different amounts of cysteine, J. Agric. Food Chem., 1994, 42, 8, 1743-1746, https://doi.org/10.1021/jf00044a032 . [all data]

Didzbalis and Ho, 2001
Didzbalis, J.; Ho, C.-T., Analysis of low molecular weight aldehydes formed during the Mallard reaction, ACS Symposium Series, 2001, 794, 196-107. [all data]