bromopentylmagnesium

Reaction thermochemistry data

Data compiled by: José A. Martinho Simões

Individual Reactions

Phenol (solution) + C5H11BrMg (solution) = C6H5BrMgO (solution) + Pentane (solution)

By formula: C6H6O (solution) + C5H11BrMg (solution) = C6H5BrMgO (solution) + C5H12 (solution)

Quantity Value Units Method Reference Comment
Δr-48.4 ± 1.0kcal/molRSCHolm, 1983solvent: Diethyl ether

Ethanol (solution) + C5H11BrMg (solution) = C2H5BrMgO (solution) + Pentane (solution)

By formula: C2H6O (solution) + C5H11BrMg (solution) = C2H5BrMgO (solution) + C5H12 (solution)

Quantity Value Units Method Reference Comment
Δr-47.7 ± 1.0kcal/molRSCHolm, 1983solvent: Diethyl ether

C5H11BrMg (solution) + Methylamine (solution) = CH4BrMgN (solution) + Pentane (solution)

By formula: C5H11BrMg (solution) + CH5N (solution) = CH4BrMgN (solution) + C5H12 (solution)

Quantity Value Units Method Reference Comment
Δr-31.19 ± 0.60kcal/molRSCHolm, 1983solvent: Diethyl ether

C5H11BrMg (solution) + Methane (solution) = Pentane (solution) + CH3BrMg (solution)

By formula: C5H11BrMg (solution) + CH4 (solution) = C5H12 (solution) + CH3BrMg (solution)

Quantity Value Units Method Reference Comment
Δr-3.6 ± 1.0kcal/molRSCHolm, 1983solvent: Diethyl ether

Propanedinitrile (solution) + C5H11BrMg (solution) = C3HBrMgN2 (solution) + Pentane (solution)

By formula: C3H2N2 (solution) + C5H11BrMg (solution) = C3HBrMgN2 (solution) + C5H12 (solution)

Quantity Value Units Method Reference Comment
Δr-48.59kcal/molRSCHolm, 1983solvent: Diethyl ether

Diphenylamine (solution) + C5H11BrMg (solution) = C12H10BrMgN (solution) + Pentane (solution)

By formula: C12H11N (solution) + C5H11BrMg (solution) = C12H10BrMgN (solution) + C5H12 (solution)

Quantity Value Units Method Reference Comment
Δr-28.39kcal/molRSCHolm, 1983solvent: Diethyl ether

C5H11BrMg (solution) + Trifluoroacetic acid (solution) = C2BrF3MgO2 (solution) + Pentane (solution)

By formula: C5H11BrMg (solution) + C2HF3O2 (solution) = C2BrF3MgO2 (solution) + C5H12 (solution)

Quantity Value Units Method Reference Comment
Δr-65.39kcal/molRSCHolm, 1983solvent: Diethyl ether

C5H11BrMg (solution) + Phenol, pentafluoro- (solution) = C6BrF5MgO (cr) + Pentane (solution)

By formula: C5H11BrMg (solution) + C6HF5O (solution) = C6BrF5MgO (cr) + C5H12 (solution)

Quantity Value Units Method Reference Comment
Δr-55.90kcal/molRSCHolm, 1983solvent: Diethyl ether

C5H11BrMg (solution) + Ethanol, 2,2,2-trifluoro- (solution) = C2H2BrF3MgO (solution) + Pentane (solution)

By formula: C5H11BrMg (solution) + C2H3F3O (solution) = C2H2BrF3MgO (solution) + C5H12 (solution)

Quantity Value Units Method Reference Comment
Δr-47.71kcal/molRSCHolm, 1983solvent: Diethyl ether

Methyl Alcohol (solution) + C5H11BrMg (solution) = CH3BrMgO (cr) + Pentane (solution)

By formula: CH4O (solution) + C5H11BrMg (solution) = CH3BrMgO (cr) + C5H12 (solution)

Quantity Value Units Method Reference Comment
Δr-52.51kcal/molRSCHolm, 1983solvent: Diethyl ether

References

Holm, 1983
Holm, T., Acta Chem. Scand. B, 1983, 37, 797. [all data]