1,3,5-Hexatriene,1,1,2,3,4,5,6,6-octachloro-

Condensed phase thermochemistry data

Data compiled by: Hussein Y. Afeefy, Joel F. Liebman, and Stephen E. Stein

Quantity Value Units Method Reference Comment
Δfliquid-7.6 ± 4.5kJ/molCcbLyubarskii, Rogovtsova, et al., 1975
Quantity Value Units Method Reference Comment
Δcliquid-2543.0 ± 3.2kJ/molCcbLyubarskii, Rogovtsova, et al., 1975

References

Lyubarskii, Rogovtsova, et al., 1975
Lyubarskii, M.V.; Rogovtsova, T.A.; Epstein, G.Z.; Simonsov, V.D., Standard enthalpies of combustion and formation of some chlorine-containing organic compounds, Neftepererab. Neftekhim. (Moscow), 1975, 52. [all data]