1-(N'-Isopropylidenehydrazino)-propane-2-thiol

Reaction thermochemistry data

Data compiled by: Hussein Y. Afeefy, Joel F. Liebman, and Stephen E. Stein

Individual Reactions

1-(N'-Isopropylidenehydrazino)-propane-2-thiol = 2H-1,3,4-Thiadiazine, tetrahydro-2,2,4,6-tetramethyl-

By formula: C16H14N2 = C7H16N2S

Quantity Value Units Method Reference Comment
Δr15.8 ± 2.1kJ/molEqkShevchenko and Potekhin, 1979liquid phase; NMR

References

Shevchenko and Potekhin, 1979
Shevchenko, S.M.; Potekhin, A.A., Ring-chain tautomerism of substituted hydrazones. 13. Mercaptoalkylation of hydrazones, Khim. Geterotsikl. Soedin., 1979, 1637-16. [all data]