1-Azidohexane

Condensed phase thermochemistry data

Data compiled by: Hussein Y. Afeefy, Joel F. Liebman, and Stephen E. Stein

Quantity Value Units Method Reference Comment
Δfliquid151.kJ/molCcbMurrin and Carpenter, 1957
Quantity Value Units Method Reference Comment
Δcliquid-4371. ± 3.kJ/molCcbMurrin and Carpenter, 1957

References

Murrin and Carpenter, 1957
Murrin, J.W.; Carpenter, G.A., The heats of combustion of 1-azidooctane, 1-azidoheptane, 1-azidohexane, and 1-azidopentane, U.S. Naval Powder Factory Research and Development Department, 1957, 1-9. [all data]