2H-1,3,4-Thiadiazine, tetrahydro-2,2-dimethyl-

Reaction thermochemistry data

Data compiled by: Hussein Y. Afeefy, Joel F. Liebman, and Stephen E. Stein

Individual Reactions

2-(N'-Isopropylidenehydrazino)-ethanethiol = 2H-1,3,4-Thiadiazine, tetrahydro-2,2-dimethyl-

By formula: C5H12N2S = C5H12N2S

Quantity Value Units Method Reference Comment
Δr3.20 ± 0.24kcal/molEqkShevchenko and Potekhin, 1979liquid phase; NMR

References

Shevchenko and Potekhin, 1979
Shevchenko, S.M.; Potekhin, A.A., Ring-chain tautomerism of substituted hydrazones. 13. Mercaptoalkylation of hydrazones, Khim. Geterotsikl. Soedin., 1979, 1637-16. [all data]