Isopropyl acrylate

Phase change data

Data compiled by: Thermodynamics Research Center, NIST Boulder Laboratories, Chris Muzny director

Quantity Value Units Method Reference Comment
Tboil383.KN/AIpatov, 1940Uncertainty assigned by TRC = 5. K

In addition to the Thermodynamics Research Center (TRC) data available from this site, much more physical and chemical property data is available from the following TRC products:

References

Ipatov, 1940
Ipatov, A.V., Isopropyl and Butyl Esters of Acrylic Acid, J. Gen. Chem. U.S.S.R., 1940, 10, 866. [all data]