Ethanol, 2-(2-propoxyethoxy)-

Phase change data

Data compiled as indicated in comments:
TRC - Thermodynamics Research Center, NIST Boulder Laboratories, Chris Muzny director
AC - William E. Acree, Jr., James S. Chickos

Quantity Value Units Method Reference Comment
Tboil486.KN/AMikhant'ev, Mikhant'ev, et al., 1966Uncertainty assigned by TRC = 5. K; TRC
Quantity Value Units Method Reference Comment
Tfus219.9KN/AAnonymous, 1954Uncertainty assigned by TRC = 0.6 K; TRC
Quantity Value Units Method Reference Comment
Tc680.KN/ASteele, Chirico, et al., 1996Uncertainty assigned by TRC = 7. K; TRC
Tc679.8KN/ATeja and Rosenthal, 1991Uncertainty assigned by TRC = 1. K; TRC
Tc687.KN/AAnselme and Teja, 1990Uncertainty assigned by TRC = 13. K; TRC
Quantity Value Units Method Reference Comment
Pc30.40barN/ASteele, Chirico, et al., 1996Uncertainty assigned by TRC = 4.00 bar; from extraploation of obs. vapor pressures to Tc; TRC
Pc30.00barN/ATeja and Rosenthal, 1991Uncertainty assigned by TRC = 0.20 bar; TRC
Quantity Value Units Method Reference Comment
ρc1.92mol/lN/ASteele, Chirico, et al., 1996Uncertainty assigned by TRC = 0.13 mol/l; TRC
ρc2.04mol/lN/AAnselme and Teja, 1990Uncertainty assigned by TRC = 0.03 mol/l; TRC
Quantity Value Units Method Reference Comment
Δvap65.7 ± 0.8kJ/molEBSteele, Chirico, et al., 1996, 2Based on data from 378. - 495. K.; AC

Enthalpy of vaporization

ΔvapH (kJ/mol) Temperature (K) Method Reference Comment
65.3384.AStephenson and Malanowski, 1987Based on data from 369. - 404. K.; AC

In addition to the Thermodynamics Research Center (TRC) data available from this site, much more physical and chemical property data is available from the following TRC products:

References

Mikhant'ev, Mikhant'ev, et al., 1966
Mikhant'ev, B.I.; Mikhant'ev, V.B.; Mikhant'eva, O.N., Alkyl Carbitols, Tr. Probl. Lab. Khim. Vysokomol. Soedin., Voronezh. Gos. Univ., 1966, No. 4, 42-3. [all data]

Anonymous, 1954
Anonymous, R., , Am. Pet. Inst. Res. Proj. 45, Tech. Rep. 13, Ohio State Univ., 1954. [all data]

Steele, Chirico, et al., 1996
Steele, W.V.; Chirico, R.D.; Knipmeyer, S.E.; Nguyen, A., Vapor pressure of acetophenone, (+-)-1,2-butanediol, (+-)-1,3-butanediol, diethylene glycol monopropyl ether, 1,3-dimethyladamantane, 2-ethoxyethyl acetate, ethyl octyl sufide, and pentyl acetate, J. Chem. Eng. Data, 1996, 41, 1255-68. [all data]

Teja and Rosenthal, 1991
Teja, A.S.; Rosenthal, D.J., The critical pressures and temperatures of ten substances using a low residence time flow apparatus in Experimental Results for Phase Equilibria and Pure Component Properties, DIPPR DATA Series No. 1, 1991. [all data]

Anselme and Teja, 1990
Anselme, M.J.; Teja, A.S., The critical properties of rapidly reacting substances, AIChE Symp. Ser., 1990, 86, 279, 128-32. [all data]

Steele, Chirico, et al., 1996, 2
Steele, W.V.; Chirico, R.D.; Knipmeyer, S.E.; Nguyen, A., Vapor Pressure of Acetophenone, (±)-1,2-Butanediol, (±)-1,3-Butanediol, Diethylene Glycol Monopropyl Ether, 1,3-Dimethyladamantane, 2-Ethoxyethyl Acetate, Ethyl Octyl Sulfide, and Pentyl Acetate, J. Chem. Eng. Data, 1996, 41, 6, 1255-1268, https://doi.org/10.1021/je9601117 . [all data]

Stephenson and Malanowski, 1987
Stephenson, Richard M.; Malanowski, Stanislaw, Handbook of the Thermodynamics of Organic Compounds, 1987, https://doi.org/10.1007/978-94-009-3173-2 . [all data]