2,2',4,4',5,5'-Hexabromodiphenyl ether

Phase change data

Data compiled by: William E. Acree, Jr., James S. Chickos

Enthalpy of vaporization

ΔvapH (kJ/mol) Temperature (K) Method Reference Comment
107.6418.GCWong, Lei, et al., 2001Based on data from 363. - 473. K.

References

Wong, Lei, et al., 2001
Wong, Alexander; Lei, Ying Duan; Alaee, Mehran; Wania, Frank, Vapor Pressures of the Polybrominated Diphenyl Ethers, J. Chem. Eng. Data, 2001, 46, 2, 239-242, https://doi.org/10.1021/je0002181 . [all data]