7-Methoxy-1-tetralone

Phase change data

Data compiled by: William E. Acree, Jr., James S. Chickos

Quantity Value Units Method Reference Comment
Δsub103.1 ± 0.9kJ/molCMatos, Sousa, et al., 2009

Enthalpy of fusion

ΔfusH (kJ/mol) Temperature (K) Method Reference
23.2334.8DSCMatos, Sousa, et al., 2009

References

Matos, Sousa, et al., 2009
Matos, M. Agostinha R.; Sousa, Clara C.S.; Morais, Victor M.F., Thermochemical study of some methoxytetralones, The Journal of Chemical Thermodynamics, 2009, 41, 1, 69-73, https://doi.org/10.1016/j.jct.2008.07.021 . [all data]