1,1'-Biphenyl, 2,3,4',5,6-Pentachloro-

Normal alkane RI, non-polar column, temperature ramp

Data compiled by: NIST Mass Spectrometry Data Center, William E. Wallace, director

Column type Capillary
Active phase SPB-1
Column length (m) 30.
Carrier gas
Substrate
Column diameter (mm) 0.25
Phase thickness (μm) 0.25
Tstart (C) 130.
Tend (C) 280.
Heat rate (K/min) 4.
Initial hold (min)
Final hold (min)
I 2112.
ReferenceNakano, Tsuji, et al., 1987
Comment MSDC-RI

References

Nakano, Tsuji, et al., 1987
Nakano, T.; Tsuji, M.; Okuno, T., Analytical methods for PCB using GC/ECD and GC/MS with capillary column, Report of the Environmental Science Institute of Hyoho Prefecture, 1987, 19, 57-62. [all data]