Pentane, 2-methoxy-

Phase change data

Data compiled by: Thermodynamics Research Center, NIST Boulder Laboratories, Chris Muzny director

Quantity Value Units Method Reference Comment
Tboil365.KN/ADoering and Young, 1952Uncertainty assigned by TRC = 3. K

In addition to the Thermodynamics Research Center (TRC) data available from this site, much more physical and chemical property data is available from the following TRC products:

References

Doering and Young, 1952
Doering, W. vonE.; Young, R.W., Configurational Interrelationships of Some Secondary Carbinols, J. Am. Chem. Soc., 1952, 74, 2997-9. [all data]