1,5-Diazabicyclo[3.1.0]hexane,2-methyl-

Gas phase ion energetics data

Data compiled as indicated in comments:
LLK - Sharon G. Lias, Rhoda D. Levin, and Sherif A. Kafafi

Ionization energy determinations

IE (eV) Method Reference Comment
8.78PEHaselbach, Mannschreck, et al., 1973Vertical value; LLK

References

Haselbach, Mannschreck, et al., 1973
Haselbach, E.; Mannschreck, A.; Seitz, W., Lone pair electronic structure, conformation and oxidation behaviour of diaziridines, Helv. Chim. Acta, 1973, 56, 1614. [all data]