cis-3-Hexenyltiglate

Van Den Dool and Kratz RI, non-polar column, temperature ramp

View large format table.

Column type Active phase I Reference Comment
CapillaryVF-5MS1325.Liang, 201030. m/0.25 mm/0.25 μm, He; Tstart: 60. C; Tend: 270. C
CapillaryHP-5MS1274.Saroglou, Dorizas, et al., 200630. m/0.25 mm/0.25 μm, He, 60. C @ 5. min, 4. K/min; Tend: 280. C

References

Liang, 2010
Liang, Y., Retention Data. NIST Mass Spectrometry Data Center., NIST Mass Spectrometry Data Center, 2010. [all data]

Saroglou, Dorizas, et al., 2006
Saroglou, V.; Dorizas, N.; Kypriotakis, Z.; Skaltsa, H.D., Analysis of the essential oil composition of eight Anthemis species from Greece, J. Chromatogr. A, 2006, 1104, 1-2, 313-322, https://doi.org/10.1016/j.chroma.2005.11.087 . [all data]