Isoxazolidine,2-(1,1-dimethylethyl)-

Gas phase ion energetics data

Data compiled by: Sharon G. Lias, Rhoda D. Levin, and Sherif A. Kafafi

Ionization energy determinations

IE (eV) Method Reference
8.25PERademacher and Freckmann, 1978

References

Rademacher and Freckmann, 1978
Rademacher, P.; Freckmann, B., Photoelectron spectra and conformations of tetrahydro-1,2-oxazines and isoxazolidines, Tetrahedron Lett., 1978, 841. [all data]