3,4,4-trimethylhexan-1-ol

Phase change data

Data compiled by: Thermodynamics Research Center, NIST Boulder Laboratories, Chris Muzny director

Quantity Value Units Method Reference Comment
Tboil464.15KN/AFreedman and Becker, 1951Uncertainty assigned by TRC = 4. K

In addition to the Thermodynamics Research Center (TRC) data available from this site, much more physical and chemical property data is available from the following TRC products:

References

Freedman and Becker, 1951
Freedman, R.W.; Becker, K., The reaction of grignard reagents with 3,4-epoxy-1-butene: II ethylmagnesium bromide and diethylmagnesium, J. Org. Chem., 1951, 16, 1701. [all data]