2-Methylbicyclohexyl

Phase change data

Data compiled by: Thermodynamics Research Center, NIST Boulder Laboratories, Chris Muzny director

Quantity Value Units Method Reference Comment
Tboil523.02KN/AGoodman and Wise, 1951Uncertainty assigned by TRC = 0.3 K; sample 1 is low boiling isomer
Tboil528.15KN/AGoodman and Wise, 1951Uncertainty assigned by TRC = 0.4 K; sample 2 is high boiling isomer
Quantity Value Units Method Reference Comment
Tfus246.72KN/AGoodman and Wise, 1951Uncertainty assigned by TRC = 0.2 K; sample 1 is - low boiling isomer
Tfus262.88KN/AGoodman and Wise, 1951Uncertainty assigned by TRC = 0.3 K; sample 2 is high boiling isomer

In addition to the Thermodynamics Research Center (TRC) data available from this site, much more physical and chemical property data is available from the following TRC products:

Condensed phase thermochemistry data

Data compiled by: Eugene S. Domalski and Elizabeth D. Hearing

Constant pressure heat capacity of liquid

Cp,liquid (cal/mol*K) Temperature (K) Reference Comment
79.21313.Gudinowicz, Campbell, et al., 1963T = 313 to 483 K.

References

Goodman and Wise, 1951
Goodman, I.A.; Wise, P.H., Dicyclic Hydrocarbons. II. 2-Alkylbicyclohexyls, J. Am. Chem. Soc., 1951, 73, 850-1. [all data]