Ambrox

Kovats' RI, non-polar column, custom temperature program

Data compiled by: NIST Mass Spectrometry Data Center, William E. Wallace, director

Column type Capillary
Active phase HP-5
Column length (m) 30.
Carrier gas He
Substrate
Column diameter (mm) 0.25
Phase thickness (μm) 0.25
Program 50 0C 20 K/min -> 70 0C 9 K/min -> 280 0C
I 1756.
ReferenceStojanovic, Palic, et al., 2000
Comment MSDC-RI

Normal alkane RI, polar column, custom temperature program

Data compiled by: NIST Mass Spectrometry Data Center, William E. Wallace, director

Column type Capillary
Active phase DB-Wax
Column length (m) 60.
Carrier gas N2
Substrate
Column diameter (mm)
Phase thickness (μm) 0.25
Program not specified
I 2199.
ReferenceWeyerstahl, Marschall, et al., 1998
Comment MSDC-RI

References

Stojanovic, Palic, et al., 2000
Stojanovic, G.; Palic, R.; Alagic, S.; Zekovic, Z., Chemical composition and antimicrobial activity of the essential oil and CO2 extracts of semi-oriental tobacco, Otlja, Flavour Fragr. J., 2000, 15, 5, 335-338, https://doi.org/10.1002/1099-1026(200009/10)15:5<335::AID-FFJ921>3.0.CO;2-W . [all data]