N-Benzyl O-methyl thiocarbamate

Normal alkane RI, non-polar column, temperature ramp

Data compiled by: NIST Mass Spectrometry Data Center, William E. Wallace, director

Column type Capillary
Active phase HP-1
Column length (m) 50.
Carrier gas He
Substrate
Column diameter (mm) 0.2
Phase thickness (μm) 0.5
Tstart (C) 60.
Tend (C) 250.
Heat rate (K/min) 2.
Initial hold (min)
Final hold (min) 120.
I 1608.
ReferenceBreme K., Fernandez X., et al., 2007
Comment MSDC-RI

References

Breme K., Fernandez X., et al., 2007
Breme K.; Fernandez X.; Meierhenrich U.J.; Brevard H.; Joulain D., Identification of New, Odor-Active Thiocarbamates in Cress Extracts and Structure-Activity Studies on Synthesized Homologues, J. Agric. Food Chem., 2007, 55, 5, 1932-1938, https://doi.org/10.1021/jf062856e . [all data]