Benzene-hexa-n-octanoate

Condensed phase thermochemistry data

Data compiled by: Eugene S. Domalski and Elizabeth D. Hearing

Quantity Value Units Method Reference Comment
solid,1 bar1514.2J/mol*KN/ASorai, Yoshioka, et al., 1982

Constant pressure heat capacity of solid

Cp,solid (J/mol*K) Temperature (K) Reference Comment
2131.3298.15Sorai, Yoshioka, et al., 1982T = 13 to 393 K.

References

Sorai, Yoshioka, et al., 1982
Sorai, M.; Yoshioka, H.; Suga, H., Studies on mesogenic disk-like molecules. III. Heat capacity of benzene hexa-n-octanoate from 13 to 393 K, Mol. Cryst. Liq. Cryst., 1982, 84, 39-54. [all data]