(Z) Ethene-1,2-diol

Gas phase thermochemistry data

Data compiled by: Hussein Y. Afeefy, Joel F. Liebman, and Stephen E. Stein

Quantity Value Units Method Reference Comment
Δfgas-316.kJ/molIonTurecek and Havlas, 1986

References

Turecek and Havlas, 1986
Turecek, F.; Havlas, Z., Thermochemistry of unstable enols: the O-(Cd)(H) group equivalent, J. Org. Chem., 1986, 51, 4066-4067. [all data]