Pentoxifylline

Kovats' RI, non-polar column, isothermal

View large format table.

Column type Active phase Temperature (C) I Reference Comment
PackedSE-30220.2371.Musumarra, Scarlata, et al., 1987N2, 1% se-30 on Anachrom ABS(80-100mesh); Column length: 2. m
CapillaryCross-Linked Methylsilicone230.2389.Burrows and Jolley, 198525. m/0.31 mm/0.17 μm, He
PackedOV-1240.2420.Bryce and Burrows, 1980Chromosorb W HP (100-120 mesh); Column length: 2. m

References

Musumarra, Scarlata, et al., 1987
Musumarra, G.; Scarlata, G.; Romano, G.; Cappello, G.; Clementi, S.; Giulietti, G., Qualitative organic analysis. Part 2. Identification of drugs by principal components analysis of standardized TLC data in four eluent systems and of retention indices on SE 30, J. Anal. Toxicol., 1987, 11, 4, 154-163, https://doi.org/10.1093/jat/11.4.154 . [all data]

Burrows and Jolley, 1985
Burrows, J.L.; Jolley, K.W., Determination of Oxpentifylline and Four Metabolites in Plasma and Urine by Automated Capillary Gas Chromatography Using Nitrogen-Selective Detection, J. Chromatogr., 1985, 344, 187-198, https://doi.org/10.1016/S0378-4347(00)82019-8 . [all data]

Bryce and Burrows, 1980
Bryce, T.A.; Burrows, J.L., Determination of Oxpentifylline and a Metabolite, 1-(5'-Hydroxyhexyl)-3, 7-Dimethylxanthine, by Gas-Liquid Chromatography Using a Nitrogen-Selective Detector, J. Chromatogr., 1980, 181, 3-4, 355-361, https://doi.org/10.1016/S0378-4347(00)81138-X . [all data]