Bicyclo[4.2.1]nona-2,4-diene,9-methoxy, syn-

Gas phase ion energetics data

Data compiled by: Sharon G. Lias, Rhoda D. Levin, and Sherif A. Kafafi

Ionization energy determinations

IE (eV) Method Reference Comment
8.28 ± 0.02PEBrown and Marcinko, 1977Vertical value

References

Brown and Marcinko, 1977
Brown, R.S.; Marcinko, R.W., Application of photoelectron spectroscopy to intramolecular hydrogen bonding. 6. The relative importance of electrostatic and covalent contributions to the H bond of H-bonded alcohols containing a conjugated olefin as the electron donor, J. Am. Chem. Soc., 1977, 99, 6500. [all data]