Ethyl-m-phenylenediisocyanate

Phase change data

Data compiled as indicated in comments:
ALS - Hussein Y. Afeefy, Joel F. Liebman, and Stephen E. Stein
AC - William E. Acree, Jr., James S. Chickos

Quantity Value Units Method Reference Comment
Δvap61.1 ± 0.8kJ/molVZhuravlev, Melen'teva, et al., 1977Mixture 88.5 :11.5%; ALS

Enthalpy of vaporization

ΔvapH (kJ/mol) Temperature (K) Method Reference Comment
60.7378.AStephenson and Malanowski, 1987Based on data from 363. - 473. K. See also Zhuravlev, Melent'eva, et al., 1977.; AC

Gas phase thermochemistry data

Data compiled by: Hussein Y. Afeefy, Joel F. Liebman, and Stephen E. Stein

Quantity Value Units Method Reference Comment
Δfgas-135. ± 3.kJ/molCcbZhuravlev, Melen'teva, et al., 1977Mixture 88.5 :11.5%

References

Zhuravlev, Melen'teva, et al., 1977
Zhuravlev, E.Z.; Melen'teva, T.I.; Mulyanov, P.V.; Kormushechkina, A.I.; Bogdanova, T.M.; Konstantinov, I.I., Physicochemical properties of ethyl-m-phenylene diisocyanate, J. Appl. Chem. USSR, 1977, 50, 1932-1934. [all data]

Stephenson and Malanowski, 1987
Stephenson, Richard M.; Malanowski, Stanislaw, Handbook of the Thermodynamics of Organic Compounds, 1987, https://doi.org/10.1007/978-94-009-3173-2 . [all data]

Zhuravlev, Melent'eva, et al., 1977
Zhuravlev, E.Z.; Melent'eva, T.L.; Mulyanov, P.V.; Kormushechkina, A.I.; Bogdanova, T.M.; Konstantinov, I.I., Zh. Prikl. Khim. (Leningrad), 1977, 50, 2032. [all data]