Methyl n-hexyl disulfide

Kovats' RI, polar column, isothermal

View large format table.

Column type Active phase Temperature (C) I Reference Comment
PackedCarbowax 20M110.1540.Möckel and Zolg, 1977He, Chromosorb W AW (80-100 mesh); Column length: 6. m

Van Den Dool and Kratz RI, polar column, temperature ramp

View large format table.

Column type Active phase I Reference Comment
CapillaryDB-Wax1605.Shimoda, Peralta, et al., 199660. m/0.25 mm/0.25 μm, He, 3. K/min; Tstart: 50. C; Tend: 230. C

References

Möckel and Zolg, 1977
Möckel, H.J.; Zolg, M., Retentionsindices n-aliphatischer Schwefelverbindungen, Z. Anal. Chem., 1977, 285, 1, 45-46, https://doi.org/10.1007/BF00446017 . [all data]

Shimoda, Peralta, et al., 1996
Shimoda, M.; Peralta, R.R.; Osajima, Y., Headspace gas analysis of fish sauce, J. Agric. Food Chem., 1996, 44, 11, 3601-3605, https://doi.org/10.1021/jf960345u . [all data]