Propanoic acid, 2-methyl-, propyl ester

Phase change data

Data compiled as indicated in comments:
TRC - Thermodynamics Research Center, NIST Boulder Laboratories, Chris Muzny director
AC - William E. Acree, Jr., James S. Chickos

Quantity Value Units Method Reference Comment
Tboil407.1KN/ALecat, 1927Uncertainty assigned by TRC = 0.5 K; TRC
Tboil412.0KN/ASchiff, 1884Uncertainty assigned by TRC = 2. K; TRC
Quantity Value Units Method Reference Comment
Tc579.4KN/AYoung, 1994Uncertainty assigned by TRC = 0.6 K; TRC
Tc589.2KN/APawlewski, 1882Uncertainty assigned by TRC = 6. K; TRC

Enthalpy of vaporization

ΔvapH (kJ/mol) Temperature (K) Method Reference Comment
50.5282.AStephenson and Malanowski, 1987Based on data from 267. - 407. K. See also Stull, 1947.; AC

Antoine Equation Parameters

log10(P) = A − (B / (T + C))
    P = vapor pressure (bar)
    T = temperature (K)

View plot Requires a JavaScript / HTML 5 canvas capable browser.

Temperature (K) A B C Reference Comment
266.9 - 407.14.401481545.216-54.902Stull, 1947Coefficents calculated by NIST from author's data.

In addition to the Thermodynamics Research Center (TRC) data available from this site, much more physical and chemical property data is available from the following TRC products:

Normal alkane RI, polar column, custom temperature program

Data compiled by: NIST Mass Spectrometry Data Center, William E. Wallace, director

Column type Capillary
Active phase Carbowax 20M
Column length (m)
Carrier gas
Substrate
Column diameter (mm)
Phase thickness (μm)
Program not specified
I 1044.
ReferenceVinogradov, 2004
Comment MSDC-RI

Normal alkane RI, non-polar column, temperature ramp

Data compiled by: NIST Mass Spectrometry Data Center, William E. Wallace, director

Column type CapillaryCapillaryCapillaryCapillary
Active phase ZB-1ZB-1DB-1OV-101
Column length (m) 30.30.60.50.
Carrier gas NitrogenN2He
Substrate
Column diameter (mm) 0.250.250.250.28
Phase thickness (μm) 0.250.250.25
Tstart (C) 45.45.50.80.
Tend (C) 230.230.250.200.
Heat rate (K/min) 3.3.2.52.
Initial hold (min)   5.
Final hold (min)
I 866.866.844.842.
ReferenceMierendorff, Stahl-Biskup, et al., 2008Mierendorff, Stahl-Biskup, et al., 2003Stashenko, Puertas, et al., 1996Anker, Jurs, et al., 1990
Comment MSDC-RI MSDC-RI MSDC-RI MSDC-RI

Kovats' RI, polar column, isothermal

Data compiled by: NIST Mass Spectrometry Data Center, William E. Wallace, director

Column type CapillaryCapillaryCapillaryPacked
Active phase OV-351OV-351OV-351Carbowax 20M
Column length (m) 25.25.25.3.
Carrier gas N2N2N2
Substrate    Chromosorb WAW (60-80 mesh)
Column diameter (mm) 0.320.320.32
Phase thickness (μm)
Temperature (C) 100.60.80.100.
I 1108.1100.1094.1051.
ReferenceHaken and Korhonen, 1985Haken and Korhonen, 1985Haken and Korhonen, 1985Chastrette, Heintz, et al., 1974
Comment MSDC-RI MSDC-RI MSDC-RI MSDC-RI

Normal alkane RI, polar column, temperature ramp

Data compiled by: NIST Mass Spectrometry Data Center, William E. Wallace, director

Column type Capillary
Active phase Carbowax 20M
Column length (m) 80.
Carrier gas
Substrate
Column diameter (mm) 0.2
Phase thickness (μm)
Tstart (C) 70.
Tend (C) 170.
Heat rate (K/min) 2.
Initial hold (min)
Final hold (min)
I 1044.
ReferenceAnker, Jurs, et al., 1990
Comment MSDC-RI

Kovats' RI, non-polar column, custom temperature program

Data compiled by: NIST Mass Spectrometry Data Center, William E. Wallace, director

Column type Capillary
Active phase SE-30
Column length (m)
Carrier gas
Substrate
Column diameter (mm)
Phase thickness (μm)
Program not specified
I 836.
ReferenceChretien and Dubois, 1978
Comment MSDC-RI

References

Lecat, 1927
Lecat, M., New binary azeotropes: 6th list, Ann. Soc. Sci. Bruxelles, Ser. B, 1927, 47, 63-71. [all data]

Schiff, 1884
Schiff, R., The Capillary Constants of Liquids at Their Boiling Point, Justus Liebigs Ann. Chem., 1884, 223, 47-106. [all data]

Young, 1994
Young, C.L., Personal Commun. 1994 1994, 1994. [all data]

Pawlewski, 1882
Pawlewski, B., The critical temperatures of ester compounds, Ber. Dtsch. Chem. Ges., 1882, 15, 2460-4. [all data]

Stephenson and Malanowski, 1987
Stephenson, Richard M.; Malanowski, Stanislaw, Handbook of the Thermodynamics of Organic Compounds, 1987, https://doi.org/10.1007/978-94-009-3173-2 . [all data]

Stull, 1947
Stull, Daniel R., Vapor Pressure of Pure Substances. Organic and Inorganic Compounds, Ind. Eng. Chem., 1947, 39, 4, 517-540, https://doi.org/10.1021/ie50448a022 . [all data]