Phenol, 3,4,5-trimethoxy-

Phase change data

Data compiled by: William E. Acree, Jr., James S. Chickos

Enthalpy of fusion

ΔfusH (kJ/mol) Temperature (K) Reference
31.94420.2Matos, Miranda, et al., 2008

References

Matos, Miranda, et al., 2008
Matos, M. Agostinha R.; Miranda, Margarida S.; Morais, Victor M.F., 3,4,5-Trimethoxyphenol: A combined experimental and theoretical thermochemical investigation of its antioxidant capacity, The Journal of Chemical Thermodynamics, 2008, 40, 4, 625-631, https://doi.org/10.1016/j.jct.2007.11.006 . [all data]