Methyl 2,4,4-trimethylpentanoate

Phase change data

Data compiled as indicated in comments:
ALS - Hussein Y. Afeefy, Joel F. Liebman, and Stephen E. Stein
AC - William E. Acree, Jr., James S. Chickos

Quantity Value Units Method Reference Comment
Δvap48.39 ± 0.18kJ/molVVerevkin, Beckhaus, et al., 1996ALS
Δvap48.4 ± 0.2kJ/molGSVerevkin, Beckhaus, et al., 1996Based on data from 278. - 318. K.; AC

References

Verevkin, Beckhaus, et al., 1996
Verevkin, S.P.; Beckhaus, H.-D.; Belen'kaja, R.S.; Rakus, K.; Ruchardt, C., Geminal substituent effects Part 9. Standard enthalpies of formation and strain free increments of branched esters and ethers, Thermochim. Acta, 1996, 279, 47-64. [all data]