Benzo[b]thiophene 1,1-dioxide, 3-methyl-

Condensed phase thermochemistry data

Data compiled by: Hussein Y. Afeefy, Joel F. Liebman, and Stephen E. Stein

Quantity Value Units Method Reference Comment
Δfliquid51.15kcal/molCcbNuritdinov, Numanov, et al., 1973hf_SO2=-70.96 kcal/mol
Quantity Value Units Method Reference Comment
Δcliquid-1242. ± 20.kcal/molCcbNuritdinov, Numanov, et al., 1973hf_SO2=-70.96 kcal/mol

References

Nuritdinov, Numanov, et al., 1973
Nuritdinov, S.; Numanov, I.U.; Nasyrov, I.M., Heats of formation of some 1-thiaindene sulfones, Dokl. Akad. Nauk. Tadzh. SSR, 1973, 16, 34-37. [all data]