HOCO+

Reaction thermochemistry data

Data compiled by: Michael M. Meot-Ner (Mautner) and Sharon G. Lias

Individual Reactions

CHO2+ + Carbon dioxide = (CHO2+ • Carbon dioxide)

By formula: CHO2+ + CO2 = (CHO2+ • CO2)

Quantity Value Units Method Reference Comment
Δr19.8kcal/molPHPMSSzulejko and McMahon, 1992gas phase
Δr18.0kcal/molPHPMSHiraoka, Shoda, et al., 1986gas phase
Δr19.1kcal/molPHPMSJennings, Headley, et al., 1982gas phase
Δr20.1kcal/molPHPMSMeot-Ner (Mautner) and Field, 1977gas phase
Quantity Value Units Method Reference Comment
Δr26.6cal/mol*KPHPMSSzulejko and McMahon, 1992gas phase
Δr22.2cal/mol*KPHPMSHiraoka, Shoda, et al., 1986gas phase
Δr27.1cal/mol*KPHPMSJennings, Headley, et al., 1982gas phase
Δr24.2cal/mol*KPHPMSMeot-Ner (Mautner) and Field, 1977gas phase

(CHO2+ • 2Carbon dioxide) + Carbon dioxide = (CHO2+ • 3Carbon dioxide)

By formula: (CHO2+ • 2CO2) + CO2 = (CHO2+ • 3CO2)

Quantity Value Units Method Reference Comment
Δr5.9kcal/molPHPMSHiraoka, Shoda, et al., 1986gas phase; Entropy change calculated or estimated
Quantity Value Units Method Reference Comment
Δr24.cal/mol*KN/AHiraoka, Shoda, et al., 1986gas phase; Entropy change calculated or estimated

(CHO2+ • Carbon dioxide) + Carbon dioxide = (CHO2+ • 2Carbon dioxide)

By formula: (CHO2+ • CO2) + CO2 = (CHO2+ • 2CO2)

Quantity Value Units Method Reference Comment
Δr6.9kcal/molPHPMSHiraoka, Shoda, et al., 1986gas phase
Quantity Value Units Method Reference Comment
Δr23.0cal/mol*KPHPMSHiraoka, Shoda, et al., 1986gas phase

References

Szulejko and McMahon, 1992
Szulejko, J.; McMahon, T.B., personal communication, 1992. [all data]

Hiraoka, Shoda, et al., 1986
Hiraoka, K.; Shoda, T.; Morise, K.; Yamabe, S.; Kawai, E.; Hirao, K., Stability and structure of cluster ions in the gas phase: Carbon dioxide with Cl-, H3O+, HCO2+ and HCO+, J. Chem. Phys., 1986, 84, 2091. [all data]

Jennings, Headley, et al., 1982
Jennings, K.R.; Headley, J.V.; Mason, R.S., The Temperature Dependence of Ion - Molecule Association Reactions, Int. J. Mass. Spectrom. Ion Phys, 1982, 45, 315. [all data]

Meot-Ner (Mautner) and Field, 1977
Meot-Ner (Mautner), M.; Field, F.H., Proton Affinity and Ion - Molecule Clustering in CO2 and CS2. Applications in Martian Ionospheric Chemistry, J. Chem. Phys., 1977, 66, 10, 4527, https://doi.org/10.1063/1.433706 . [all data]