2-methoxybut-2-ene

Phase change data

Data compiled by: Thermodynamics Research Center, NIST Boulder Laboratories, Chris Muzny director

Quantity Value Units Method Reference Comment
Tfus155.35KN/ADolliver, Gresham, et al., 1938Uncertainty assigned by TRC = 0.4 K

In addition to the Thermodynamics Research Center (TRC) data available from this site, much more physical and chemical property data is available from the following TRC products:

References

Dolliver, Gresham, et al., 1938
Dolliver, M.A.; Gresham, T.L.; Kistiakowsky, G.B.; Smith, E.A.; Vaughan, W.E., Heats of Organic Reactions VI. Heats of Hydrogenation of Some Oxygen- Containing Compounds, J. Am. Chem. Soc., 1938, 60, 440. [all data]