Di-n-butylphenylphosphine

Gas phase ion energetics data

Data compiled by: Sharon G. Lias, Rhoda D. Levin, and Sherif A. Kafafi

Ionization energy determinations

IE (eV) Method Reference Comment
8.03PESchmidt, Schweig, et al., 1975Vertical value

References

Schmidt, Schweig, et al., 1975
Schmidt, H.; Schweig, A.; Mathey, F.; Muller, G., Molecular conformation and hyperconjugation. P-C-hyperconjugation and the conformation of vinyl-, allyl-, phenyl- and benzylphosphines, Tetrahedron, 1975, 31, 1287. [all data]