Nisoldipine

Kovats' RI, non-polar column, temperature ramp

View large format table.

Column type Active phase I Reference Comment
CapillarySPB-12679.Wachowiak, Strach, et al., 200515. m/0.53 mm/2. μm, 240. C @ 1. min, 2. K/min, 275. C @ 1. min

References

Wachowiak, Strach, et al., 2005
Wachowiak, R.; Strach, B.; Kopatka, P., Analiza toksykologiczna wybranych pochodnych 1,4-dihydropirydyny w diagnostyce zatruc. Toxicological analysis of selected 1,4-dihydropyridyne calcium channel blockers in the diagnosis of intoxications, Arch. Med. Sad. Krym., 2005, 55, 47-54. [all data]