Benzene, 1,2,4,5-tetraethyl-

Phase change data

Data compiled as indicated in comments:
TRC - Thermodynamics Research Center, NIST Boulder Laboratories, Chris Muzny director
AC - William E. Acree, Jr., James S. Chickos

Quantity Value Units Method Reference Comment
Tfus283.KN/ARabjohn, Fronabarger, et al., 1955Uncertainty assigned by TRC = 2. K; TRC
Tfus283.KN/ASmith and Guss, 1940Uncertainty assigned by TRC = 2. K; TRC

Enthalpy of vaporization

ΔvapH (kJ/mol) Temperature (K) Method Reference Comment
54.5353.AStephenson and Malanowski, 1987Based on data from 338. - 521. K.; AC

In addition to the Thermodynamics Research Center (TRC) data available from this site, much more physical and chemical property data is available from the following TRC products:

References

Rabjohn, Fronabarger, et al., 1955
Rabjohn, N.; Fronabarger; Linstromberg, J. Org. Chem., 1955, 20, 271. [all data]

Smith and Guss, 1940
Smith, L.I.; Guss, C.O., Polyalkylbenzenes. XXVIII. Physical properties of the tetraethylbenzenes, J. Am. Chem. Soc., 1940, 62, 2630. [all data]

Stephenson and Malanowski, 1987
Stephenson, Richard M.; Malanowski, Stanislaw, Handbook of the Thermodynamics of Organic Compounds, 1987, https://doi.org/10.1007/978-94-009-3173-2 . [all data]