Butanedioic acid, phenyl-

Condensed phase thermochemistry data

Data compiled by: Hussein Y. Afeefy, Joel F. Liebman, and Stephen E. Stein

Quantity Value Units Method Reference Comment
Δcsolid-4523.3 ± 2.3kJ/molCcbVerkade and Hartman, 1933Reanalyzed by Cox and Pilcher, 1970, Original value = -4527.1 kJ/mol; At 288 K; Corresponding Δfsolid = -840.98 kJ/mol (simple calculation by NIST; no Washburn corrections)

References

Verkade and Hartman, 1933
Verkade, P.E.; Hartman, H., Calorimetric researches XXI. Heats of combustion of methyl-, ethyl- and phenyl-substituted succinic acids and of their anhydrides: a. Experimental data, Rec. Trav. Chim. Pays/Bas, 1933, 52, 945-968. [all data]

Cox and Pilcher, 1970
Cox, J.D.; Pilcher, G., Thermochemistry of Organic and Organometallic Compounds, Academic Press, New York, 1970, 1-636. [all data]