2-Pentanone,4,4'-(1,2-ethanediyldinitrilo)bis-

Gas phase ion energetics data

Data compiled by: Sharon G. Lias, Rhoda D. Levin, and Sherif A. Kafafi

Ionization energy determinations

IE (eV) Method Reference Comment
7.71PECondorelli, Fragala, et al., 1973Vertical value

References

Condorelli, Fragala, et al., 1973
Condorelli, G.; Fragala, I.; Centineo, G.; Tondello, E., The electronic structure and photoelectron spectra of Ni(II), Cu(II) and Pd(II) complexes with N,N'-ethylene-bis(acetylacetoneiminato) dianion, Inorg. Chim. Acta, 1973, 7, 725. [all data]