4-Pentynoic acid ethyl ester

Condensed phase thermochemistry data

Data compiled by: Hussein Y. Afeefy, Joel F. Liebman, and Stephen E. Stein

Quantity Value Units Method Reference Comment
Δfliquid-282. ± 3.kJ/molCcbSchjanberg, 1938Heat of formation derived by Cox and Pilcher, 1970
Quantity Value Units Method Reference Comment
Δcliquid-3902.0 ± 2.5kJ/molCcbSchjanberg, 1938Reanalyzed by Cox and Pilcher, 1970, Original value = -3901. ± 0.8 kJ/mol; Corresponding Δfliquid = -281.7 kJ/mol (simple calculation by NIST; no Washburn corrections)

References

Schjanberg, 1938
Schjanberg, E., Die verbrennungswarmen, die refraktionsdaten und die alkalische verseifung der athylester der β-vinylacryl saure und der drei pentinsauren, Z. Phys. Chem., 1938, 181, 430-440. [all data]

Cox and Pilcher, 1970
Cox, J.D.; Pilcher, G., Thermochemistry of Organic and Organometallic Compounds, Academic Press, New York, 1970, 1-636. [all data]