Androstenedione

Kovats' RI, non-polar column, isothermal

View large format table.

Column type Active phase Temperature (C) I Reference Comment
PackedOV-1230.2505.Baillie, Brooks, et al., 1972N2, Gas Chrom Q (100-120 mesh); Column length: 2. m

Normal alkane RI, non-polar column, isothermal

View large format table.

Column type Active phase Temperature (C) I Reference Comment
PackedOV-1180.2497.Gizella, Szabolcs, et al., 1995N2, Chromosorb WHP; Column length: 2.6 m

References

Baillie, Brooks, et al., 1972
Baillie, T.A.; Brooks, C.J.W.; Middleditch, B.S., Comparison of Corticosteroid Derivatives by Gas-Chromatography-Mass Spectrometry, Anal. Chem., 1972, 44, 1, 30-37, https://doi.org/10.1021/ac60309a016 . [all data]

Gizella, Szabolcs, et al., 1995
Gizella, P.; Szabolcs, N.; Peep, V.; György, O.P.T., Kannabinoidok gázkromatográfiás vizsgálata tandem oszlopokon, Acta Pharm. Hung., 1995, 65, 63-67. [all data]