Tetramethylbutanedioic acid

Phase change data

Data compiled as indicated in comments:
TRC - Thermodynamics Research Center, NIST Boulder Laboratories, Chris Muzny director
AC - William E. Acree, Jr., James S. Chickos
CAL - James S. Chickos, William E. Acree, Jr., Joel F. Liebman, Students of Chem 202 (Introduction to the Literature of Chemistry), University of Missouri -- St. Louis
DH - Eugene S. Domalski and Elizabeth D. Hearing

Quantity Value Units Method Reference Comment
Tfus465.KN/AMurrill and Breed, 1970Crystal phase 1 phase; Uncertainty assigned by TRC = 4. K; TRC

Enthalpy of fusion

ΔfusH (kJ/mol) Temperature (K) Reference Comment
6.47464.Domalski and Hearing, 1996AC

Entropy of fusion

ΔfusS (J/mol*K) Temperature (K) Reference Comment
35.07383.Domalski and Hearing, 1996CAL
13.95464.

Enthalpy of phase transition

ΔHtrs (kJ/mol) Temperature (K) Initial Phase Final Phase Reference Comment
13.432383.crystaline, IIcrystaline, IMurrill and Breed, 1970, 2DH
6.472464.crystaline, IliquidMurrill and Breed, 1970, 2DH

Entropy of phase transition

ΔStrs (J/mol*K) Temperature (K) Initial Phase Final Phase Reference Comment
35.27383.crystaline, IIcrystaline, IMurrill and Breed, 1970, 2DH
13.97464.crystaline, IliquidMurrill and Breed, 1970, 2DH

In addition to the Thermodynamics Research Center (TRC) data available from this site, much more physical and chemical property data is available from the following TRC products:

References

Murrill and Breed, 1970
Murrill, E.; Breed, L.W., Solid-solid Phase Transitions Determined by Differential Scanning Calorimetry Part II. Octahederal Substances, Thermochim. Acta, 1970, 1, 409. [all data]

Domalski and Hearing, 1996
Domalski, Eugene S.; Hearing, Elizabeth D., Heat Capacities and Entropies of Organic Compounds in the Condensed Phase. Volume III, J. Phys. Chem. Ref. Data, 1996, 25, 1, 1, https://doi.org/10.1063/1.555985 . [all data]

Murrill and Breed, 1970, 2
Murrill, E.; Breed, L.W., Solid-solid phase transitions determined by differental scanning calorimetry Part II. Octahedral substances, Thermochim. Acta, 1970, 1, 409-414. [all data]