1-Pentadecanol acetate

Kovats' RI, non-polar column, isothermal

View large format table.

Column type Active phase Temperature (C) I Reference Comment
CapillaryDB-1180.1857.Furr, Zeng, et al., 199015. m/0.25 mm/0.25 μm

Kovats' RI, non-polar column, temperature ramp

View large format table.

Column type Active phase I Reference Comment
CapillaryOV-1011843.Ohnishi and Shibamoto, 19842. K/min; Column length: 50. m; Column diameter: 0.23 mm; Tstart: 80. C; Tend: 200. C
CapillaryOV-1011850.Ohnishi and Shibamoto, 19842. K/min; Column length: 50. m; Column diameter: 0.23 mm; Tstart: 80. C; Tend: 200. C

Van Den Dool and Kratz RI, non-polar column, custom temperature program

View large format table.

Column type Active phase I Reference Comment
CapillaryVF-5MS1907.4Zheng and White, 200830. m/0.25 mm/0.25 μm, He; Program: not specified

References

Furr, Zeng, et al., 1990
Furr, H.C.; Zeng, S.; Clifford, A.J.; Olson, J.A., Capillary gas chromatography of retinoids (vitamin A compounds) and apo-retinoids: determination of Kováts retention indices, J. Chromatogr., 1990, 527, 406-413, https://doi.org/10.1016/S0378-4347(00)82124-6 . [all data]

Ohnishi and Shibamoto, 1984
Ohnishi, S.; Shibamoto, T., Volatile compounds from heated beef fat and beef fat with glycine, J. Agric. Food Chem., 1984, 32, 5, 987-992, https://doi.org/10.1021/jf00125a008 . [all data]

Zheng and White, 2008
Zheng, Y.; White, E., Retention Data. NIST Mass Spectrometry Data Center., NIST Mass Spectrometry Data Center, 2008. [all data]