Butane, 1-(methylthio)-

Kovats' RI, non-polar column, isothermal

View large format table.

Column type Active phase Temperature (C) I Reference Comment
PackedApiezon M130.815.Garbuzov, Misharina, et al., 1985He or N2, Chromosorb W, AW-DMCS; Column length: 2.1 m
PackedApiezon M130.815.Golovnya, Garbuzov, et al., 1976N2, Chromosorb W; Column length: 2.1 m
PackedApiezon M130.815.Golovnya and Garbuzov, 1974N2, Chromosorb W; Column length: 2.1 m
PackedApiezon L130.810.Martinu and Janák, 1970

Kovats' RI, polar column, isothermal

View large format table.

Column type Active phase Temperature (C) I Reference Comment
CapillaryPEG-20M93.1032.6Morishita, Murakita, et al., 1985Column length: 50. m; Column diameter: 0.25 mm
CapillaryPEG-20M80.1029.3Morishita, Murakita, et al., 1982N2; Column length: 50. m; Column diameter: 0.25 mm
PackedPolyethylene Glycol130.1051.Golovnya, Garbuzov, et al., 1976N2, Chromosorb W; Column length: 2.1 m

Normal alkane RI, non-polar column, temperature ramp

View large format table.

Column type Active phase I Reference Comment
CapillaryDB-5810.Savel'eva, Zenkevich, et al., 200325. m/0.20 mm/0.33 μm, Helium, 40. C @ 1. min, 5. K/min, 270. C @ 15. min

Normal alkane RI, non-polar column, custom temperature program

View large format table.

Column type Active phase I Reference Comment
CapillarySE-30813.Vinogradov, 2004Program: not specified
CapillaryPolydimethyl siloxanes811.Zenkevich, 1998Program: not specified
Capillarymethyl silicone oil with 5% Igepal801.Schultz, Flath, et al., 1988Column length: 150. m; Column diameter: 0.75 mm; Program: not specified
Capillarymethyl silicone oil with 5% Igepal803.Schultz, Flath, et al., 1988Column length: 150. m; Column diameter: 0.75 mm; Program: not specified
CapillarySE-52820.van Langenhove and Schamp, 1986Column length: 100. m; Column diameter: 0.50 mm; Program: not specified

Normal alkane RI, polar column, custom temperature program

View large format table.

Column type Active phase I Reference Comment
CapillaryCarbowax 20M1043.Vinogradov, 2004Program: not specified

Phase change data

Data compiled as indicated in comments:
BS - Robert L. Brown and Stephen E. Stein
TRC - Thermodynamics Research Center, NIST Boulder Laboratories, Chris Muzny director
AC - William E. Acree, Jr., James S. Chickos
ALS - Hussein Y. Afeefy, Joel F. Liebman, and Stephen E. Stein
DRB - Donald R. Burgess, Jr.
DH - Eugene S. Domalski and Elizabeth D. Hearing

Quantity Value Units Method Reference Comment
Tboil396.3 ± 0.5KAVGN/AAverage of 6 values; Individual data points
Quantity Value Units Method Reference Comment
Tfus175.25KN/ALanum and Morris, 1969Uncertainty assigned by TRC = 0.2 K; TRC
Tfus175.32KN/AMorris, Lanum, et al., 1960Uncertainty assigned by TRC = 0.02 K; TRC
Quantity Value Units Method Reference Comment
Ttriple175.290KN/AMcCullough, Finke, et al., 1961Uncertainty assigned by TRC = 0.05 K; TRC
Ttriple175.300KN/AMcCullough, Finke, et al., 1961Uncertainty assigned by TRC = 0.03 K; TRC
Quantity Value Units Method Reference Comment
Δvap40.8 ± 0.4kJ/molAVGN/AAverage of 9 values; Individual data points

Enthalpy of vaporization

ΔvapH (kJ/mol) Temperature (K) Method Reference Comment
40.4312.N/ADykyj, Svoboda, et al., 1999Based on data from 297. - 423. K.; AC
35.3315.AStephenson and Malanowski, 1987Based on data from 301. - 330. K.; AC
38.0358.A,EBStephenson and Malanowski, 1987Based on data from 343. - 436. K. See also McCullough, Finke, et al., 1961, 2 and Osborn and Douslin, 1966.; AC
34.47396.6N/AMajer and Svoboda, 1985
38.1313.EBMackle and Mayrick, 1962Based on data from 296. - 325. K.; AC

Antoine Equation Parameters

log10(P) = A − (B / (T + C))
    P = vapor pressure (bar)
    T = temperature (K)

View plot Requires a JavaScript / HTML 5 canvas capable browser.

Temperature (K) A B C Reference
346.90 - 435.834.070731363.808-61.076Osborn and Douslin, 1966

Enthalpy of fusion

ΔfusH (kJ/mol) Temperature (K) Reference Comment
12.452175.30McCullough, Finke, et al., 1961, 2DH
12.45175.6Lange, 1985AC

Entropy of fusion

ΔfusS (J/mol*K) Temperature (K) Reference Comment
71.03175.30McCullough, Finke, et al., 1961, 2DH

In addition to the Thermodynamics Research Center (TRC) data available from this site, much more physical and chemical property data is available from the following TRC products:

Gas phase thermochemistry data

Data compiled as indicated in comments:
ALS - Hussein Y. Afeefy, Joel F. Liebman, and Stephen E. Stein
DRB - Donald R. Burgess, Jr.

Quantity Value Units Method Reference Comment
Δfgas-101. ± 3.kJ/molCcbMackle and Mayrick, 1962ALS
Δfgas-102.2 ± 1.1kJ/molCcbGeller, 1961ALS
Δfgas-102.0kJ/molN/AMcCullough, Finke, et al., 1961Value computed using ΔfHliquid° value of -142.8±0.8 kj/mol from McCullough, Finke, et al., 1961 and ΔvapH° value of 40.8 kj/mol from Geller, 1961.; DRB

Condensed phase thermochemistry data

Data compiled as indicated in comments:
ALS - Hussein Y. Afeefy, Joel F. Liebman, and Stephen E. Stein
DH - Eugene S. Domalski and Elizabeth D. Hearing

Quantity Value Units Method Reference Comment
Δfliquid-34.0 ± 0.5kcal/molCcbMackle and Mayrick, 1962ALS
Δfliquid-34.17 ± 0.20kcal/molCcbGeller, 1961ALS
Δfliquid-34.12 ± 0.18kcal/molCcrMcCullough, Finke, et al., 1961ALS
Quantity Value Units Method Reference Comment
Δcliquid-989.99 ± 0.46kcal/molCcbMackle and Mayrick, 1962ALS
Δcliquid-989.93 ± 0.16kcal/molCcbGeller, 1961ALS
Δcliquid-989.79 ± 0.16kcal/molCcrMcCullough, Finke, et al., 1961ALS
Quantity Value Units Method Reference Comment
liquid73.489cal/mol*KN/AMcCullough, Finke, et al., 1961DH

Constant pressure heat capacity of liquid

Cp,liquid (cal/mol*K) Temperature (K) Reference Comment
48.021298.15McCullough, Finke, et al., 1961T = 11 to 370 K.; DH

References

Garbuzov, Misharina, et al., 1985
Garbuzov, V.G.; Misharina, T.A.; Aerov, A.F.; Golovnya, R.V., Gas chromatographic retention indices for sulphur(II)-containing organic substances, J. Anal. Chem. USSR (Engl. Transl.), 1985, 40, 4, 576-586. [all data]

Golovnya, Garbuzov, et al., 1976
Golovnya, R.V.; Garbuzov, V.G.; Misharina, T.A., Gas chromatographic characteristics of sulfur compounds. 2. Normal sulfides, Izv. Akad. Nauk Kaz. SSR Ser. Khim., 1976, 10, 2266-2270. [all data]

Golovnya and Garbuzov, 1974
Golovnya, R.V.; Garbuzov, V.G., Effect of heteroatom in aliphatic sulfur- and oxygen-containing compounds on the values of the retention indices in gas chromatography, Izv. Akad. Nauk SSSR Ser. Khim., 1974, 7, 1519-1521. [all data]

Martinu and Janák, 1970
Martinu, V.; Janák, J., Gas-liquid chromatographic retention data of some aliphatic and alicyclic sulphides, J. Chromatogr., 1970, 52, 69-75, https://doi.org/10.1016/S0021-9673(01)96545-8 . [all data]

Morishita, Murakita, et al., 1985
Morishita, F.; Murakita, H.; Kojima, T., Prediction of retention indices of thiols and sulfides under different conditions of capillary gas chromatography, Bunseki Kagaku, 1985, 34, 12, 800-802, https://doi.org/10.2116/bunsekikagaku.34.12_800 . [all data]

Morishita, Murakita, et al., 1982
Morishita, F.; Murakita, H.; Takemura, Y.; Kojima, T., Prediction of molecular structures of thiols and sulphides by retention indices, J. Chromatogr., 1982, 239, 483-492, https://doi.org/10.1016/S0021-9673(00)82005-1 . [all data]

Savel'eva, Zenkevich, et al., 2003
Savel'eva, E.I.; Zenkevich, I.G.; Radilov, A.S., Identification the Products of Chemical Neutralization of O-Isobutyl-S-(2-diethylaminoethyl)methylthiophosphonate in the Composition of Bitumen-Salt Matrices, Zh. Anal. Khim. (Rus.), 2003, 58, 2, 135-145. [all data]

Vinogradov, 2004
Vinogradov, B.A., Production, composition, properties and application of essential oils, 2004, retrieved from http://viness.narod.ru. [all data]

Zenkevich, 1998
Zenkevich, I.G., The Principle of Structural Analogy in the Calculation of Gas Chromatographic Retention Indices using Physico-Chemical Constants of Organic Compounds, Zh. Anal. Khim. (Rus.), 1998, 53, 1, 43-49. [all data]

Schultz, Flath, et al., 1988
Schultz, T.H.; Flath, R.A.; Stern, D.J.; Mon, T.R.; Teranishi, R.; McKenna Kruse, S.; Butlder, B.; Howard, W.E., Coyote estrous urine volatiles, J. Chem. Ecol., 1988, 14, 2, 701-712, https://doi.org/10.1007/BF01013917 . [all data]

van Langenhove and Schamp, 1986
van Langenhove, H.; Schamp, N., Identification of Volatiles in the Head Space of Acid-Treated Phosphate Rock by Gas Chromatography-Mass Spectromety, J. Chromatogr., 1986, 351, 65-75, https://doi.org/10.1016/S0021-9673(01)83473-7 . [all data]