dl-Citrulline

Condensed phase thermochemistry data

Data compiled by: Eugene S. Domalski and Elizabeth D. Hearing

Quantity Value Units Method Reference Comment
solid,1 bar60.80cal/mol*KN/AHuffman and Fox, 1940Extrapolation below 90 K, 75.94 J/mol*K.

Constant pressure heat capacity of solid

Cp,solid (cal/mol*K) Temperature (K) Reference Comment
55.641300.8Huffman and Fox, 1940T = 90 to 298 K. Value is unsmoothed experimental datum.

References

Huffman and Fox, 1940
Huffman, H.M.; Fox, S.W., Thermal data. XIII. The heat capacities and entropies of creatine hydrate, DL-citrulline, DL-ornithine, L-proline and taurine, J. Am. Chem. Soc., 1940, 62, 3464-3465. [all data]