D-arginine hydrochloride

Condensed phase thermochemistry data

Data compiled by: Eugene S. Domalski and Elizabeth D. Hearing

Quantity Value Units Method Reference Comment
solid,1 bar286.31J/mol*KN/ACole, Hutchens, et al., 1963

Constant pressure heat capacity of solid

Cp,solid (J/mol*K) Temperature (K) Reference Comment
260.96298.15Cole, Hutchens, et al., 1963T = 11 to 305 K.

References

Cole, Hutchens, et al., 1963
Cole, A.G.; Hutchens, J.O.; Stout, J.W., Heat capacities from 11 to 350°K. and entropies of L-arginine·HCl, L-histidine·HCl, and L-lysine·HCl, J. Phys. Chem., 1963, 67, 2245-2247. [all data]